From Bootz, 8 Months ago, written in C++.
Embed
  1. 14>worldserver.dir\Debug\worldPCH.obj
  2. 14>Main.obj : error LNK2019: unresolved external symbol _mysql_get_client_version@0 referenced in function "public: __thiscall DatabaseWorkerPool<class CharacterDatabaseConnection>::DatabaseWorkerPool<class CharacterDatabaseConnection>(void)" (??0?$DatabaseWorkerPool@VCharacterDatabaseConnection@@@@QAE@XZ)
  3. 14>Main.obj : error LNK2019: unresolved external symbol _mysql_thread_safe@0 referenced in function "public: __thiscall DatabaseWorkerPool<class CharacterDatabaseConnection>::DatabaseWorkerPool<class CharacterDatabaseConnection>(void)" (??0?$DatabaseWorkerPool@VCharacterDatabaseConnection@@@@QAE@XZ)
  4. 14>Master.obj : error LNK2019: unresolved external symbol _mysql_server_init@12 referenced in function "public: static void __cdecl MySQL::Library_Init(void)" (?Library_Init@MySQL@@SAXXZ)
  5. 14>Master.obj : error LNK2019: unresolved external symbol _mysql_server_end@0 referenced in function "public: static void __cdecl MySQL::Library_End(void)" (?Library_End@MySQL@@SAXXZ)
  6. 14>Master.obj : error LNK2019: unresolved external symbol _mysql_get_server_version@4 referenced in function "public: bool __thiscall DatabaseWorkerPool<class CharacterDatabaseConnection>::Open(class std::basic_string<char,struct std::char_traits<char>,class std::allocator<char> > const &,unsigned char,unsigned char)" (?Open@?$DatabaseWorkerPool@VCharacterDatabaseConnection@@@@QAE_NABV?$basic_string@DU?$char_traits@D@std@@V?$allocator@D@2@@std@@EE@Z)
  7. 14>game.lib(World.obj) : error LNK2019: unresolved external symbol _mysql_ping@4 referenced in function "public: void __thiscall MySQLConnection::Ping(void)" (?Ping@MySQLConnection@@QAEXXZ)
  8. 14>scripts.lib(cs_misc.obj) : error LNK2019: unresolved external symbol _mysql_real_escape_string@16 referenced in function "public: static class InstanceSaveManager * __cdecl ACE_Singleton<class InstanceSaveManager,class ACE_Thread_Mutex>::instance(void)" (?instance@?$ACE_Singleton@VInstanceSaveManager@@VACE_Thread_Mutex@@@@SAPAVInstanceSaveManager@@XZ)
  9. 14>scripts.lib(cs_wp.obj) : error LNK2001: unresolved external symbol _mysql_real_escape_string@16
  10. 14>game.lib(PlayerDump.obj) : error LNK2001: unresolved external symbol _mysql_real_escape_string@16
  11. 14>scripts.lib(cs_ban.obj) : error LNK2001: unresolved external symbol _mysql_real_escape_string@16
  12. 14>scripts.lib(cs_go.obj) : error LNK2001: unresolved external symbol _mysql_real_escape_string@16
  13. 14>scripts.lib(cs_gobject.obj) : error LNK2001: unresolved external symbol _mysql_real_escape_string@16
  14. 14>game.lib(CharacterHandler.obj) : error LNK2001: unresolved external symbol _mysql_real_escape_string@16
  15. 14>game.lib(GroupHandler.obj) : error LNK2001: unresolved external symbol _mysql_real_escape_string@16
  16. 14>game.lib(PetitionsHandler.obj) : error LNK2001: unresolved external symbol _mysql_real_escape_string@16
  17. 14>game.lib(Pet.obj) : error LNK2001: unresolved external symbol _mysql_real_escape_string@16
  18. 14>shared.lib(QueryResult.obj) : error LNK2019: unresolved external symbol _mysql_free_result@4 referenced in function "private: void __thiscall ResultSet::CleanUp(void)" (?CleanUp@ResultSet@@AAEXXZ)
  19. 14>shared.lib(MySQLConnection.obj) : error LNK2001: unresolved external symbol _mysql_free_result@4
  20. 14>shared.lib(QueryResult.obj) : error LNK2019: unresolved external symbol _mysql_fetch_row@4 referenced in function "public: bool __thiscall ResultSet::NextRow(void)" (?NextRow@ResultSet@@QAE_NXZ)
  21. 14>shared.lib(QueryResult.obj) : error LNK2019: unresolved external symbol _mysql_fetch_field@4 referenced in function "public: __thiscall PreparedResultSet::PreparedResultSet(struct st_mysql_stmt *,struct st_mysql_res *,unsigned __int64,unsigned int)" (??0PreparedResultSet@@QAE@PAUst_mysql_stmt@@PAUst_mysql_res@@_KI@Z)
  22. 14>shared.lib(QueryResult.obj) : error LNK2019: unresolved external symbol _mysql_stmt_fetch@4 referenced in function "private: bool __thiscall PreparedResultSet::_NextRow(void)" (?_NextRow@PreparedResultSet@@AAE_NXZ)
  23. 14>shared.lib(QueryResult.obj) : error LNK2019: unresolved external symbol _mysql_stmt_store_result@4 referenced in function "public: __thiscall PreparedResultSet::PreparedResultSet(struct st_mysql_stmt *,struct st_mysql_res *,unsigned __int64,unsigned int)" (??0PreparedResultSet@@QAE@PAUst_mysql_stmt@@PAUst_mysql_res@@_KI@Z)
  24. 14>shared.lib(QueryResult.obj) : error LNK2019: unresolved external symbol _mysql_stmt_bind_result@8 referenced in function "public: __thiscall PreparedResultSet::PreparedResultSet(struct st_mysql_stmt *,struct st_mysql_res *,unsigned __int64,unsigned int)" (??0PreparedResultSet@@QAE@PAUst_mysql_stmt@@PAUst_mysql_res@@_KI@Z)
  25. 14>shared.lib(QueryResult.obj) : error LNK2019: unresolved external symbol _mysql_stmt_free_result@4 referenced in function "private: void __thiscall PreparedResultSet::CleanUp(void)" (?CleanUp@PreparedResultSet@@AAEXXZ)
  26. 14>shared.lib(QueryResult.obj) : error LNK2019: unresolved external symbol _mysql_stmt_error@4 referenced in function "public: __thiscall PreparedResultSet::PreparedResultSet(struct st_mysql_stmt *,struct st_mysql_res *,unsigned __int64,unsigned int)" (??0PreparedResultSet@@QAE@PAUst_mysql_stmt@@PAUst_mysql_res@@_KI@Z)
  27. 14>shared.lib(MySQLConnection.obj) : error LNK2001: unresolved external symbol _mysql_stmt_error@4
  28. 14>shared.lib(QueryResult.obj) : error LNK2019: unresolved external symbol _mysql_stmt_num_rows@4 referenced in function "public: __thiscall PreparedResultSet::PreparedResultSet(struct st_mysql_stmt *,struct st_mysql_res *,unsigned __int64,unsigned int)" (??0PreparedResultSet@@QAE@PAUst_mysql_stmt@@PAUst_mysql_res@@_KI@Z)
  29. 14>shared.lib(MySQLConnection.obj) : error LNK2001: unresolved external symbol _mysql_stmt_num_rows@4
  30. 14>shared.lib(MySQLConnection.obj) : error LNK2019: unresolved external symbol _mysql_fetch_fields@4 referenced in function "public: bool __thiscall MySQLConnection::_Query(char const *,struct st_mysql_res * *,struct st_mysql_field * *,unsigned __int64 *,unsigned int *)" (?_Query@MySQLConnection@@QAE_NPBDPAPAUst_mysql_res@@PAPAUst_mysql_field@@PA_KPAI@Z)
  31. 14>shared.lib(MySQLConnection.obj) : error LNK2019: unresolved external symbol _mysql_field_count@4 referenced in function "public: bool __thiscall MySQLConnection::_Query(char const *,struct st_mysql_res * *,struct st_mysql_field * *,unsigned __int64 *,unsigned int *)" (?_Query@MySQLConnection@@QAE_NPBDPAPAUst_mysql_res@@PAPAUst_mysql_field@@PA_KPAI@Z)
  32. 14>shared.lib(MySQLConnection.obj) : error LNK2019: unresolved external symbol _mysql_affected_rows@4 referenced in function "public: bool __thiscall MySQLConnection::_Query(char const *,struct st_mysql_res * *,struct st_mysql_field * *,unsigned __int64 *,unsigned int *)" (?_Query@MySQLConnection@@QAE_NPBDPAPAUst_mysql_res@@PAPAUst_mysql_field@@PA_KPAI@Z)
  33. 14>shared.lib(MySQLConnection.obj) : error LNK2019: unresolved external symbol _mysql_errno@4 referenced in function "public: bool __thiscall MySQLConnection::Execute(char const *)" (?Execute@MySQLConnection@@QAE_NPBD@Z)
  34. 14>shared.lib(Transaction.obj) : error LNK2001: unresolved external symbol _mysql_errno@4
  35. 14>shared.lib(MySQLConnection.obj) : error LNK2019: unresolved external symbol _mysql_error@4 referenced in function "public: virtual bool __thiscall MySQLConnection::Open(void)" (?Open@MySQLConnection@@UAE_NXZ)
  36. 14>shared.lib(MySQLConnection.obj) : error LNK2019: unresolved external symbol _mysql_thread_id@4 referenced in function "private: bool __thiscall MySQLConnection::_HandleMySQLErrno(unsigned int)" (?_HandleMySQLErrno@MySQLConnection@@AAE_NI@Z)
  37. 14>shared.lib(MySQLConnection.obj) : error LNK2019: unresolved external symbol _mysql_set_character_set@8 referenced in function "public: virtual bool __thiscall MySQLConnection::Open(void)" (?Open@MySQLConnection@@UAE_NXZ)
  38. 14>shared.lib(MySQLConnection.obj) : error LNK2019: unresolved external symbol _mysql_init@4 referenced in function "public: virtual bool __thiscall MySQLConnection::Open(void)" (?Open@MySQLConnection@@UAE_NXZ)
  39. 14>shared.lib(MySQLConnection.obj) : error LNK2019: unresolved external symbol _mysql_real_connect@32 referenced in function "public: virtual bool __thiscall MySQLConnection::Open(void)" (?Open@MySQLConnection@@UAE_NXZ)
  40. 14>shared.lib(MySQLConnection.obj) : error LNK2019: unresolved external symbol _mysql_query@8 referenced in function "public: bool __thiscall MySQLConnection::Execute(char const *)" (?Execute@MySQLConnection@@QAE_NPBD@Z)
  41. 14>shared.lib(MySQLConnection.obj) : error LNK2019: unresolved external symbol _mysql_store_result@4 referenced in function "public: bool __thiscall MySQLConnection::_Query(char const *,struct st_mysql_res * *,struct st_mysql_field * *,unsigned __int64 *,unsigned int *)" (?_Query@MySQLConnection@@QAE_NPBDPAPAUst_mysql_res@@PAPAUst_mysql_field@@PA_KPAI@Z)
  42. 14>shared.lib(MySQLConnection.obj) : error LNK2019: unresolved external symbol _mysql_get_server_info@4 referenced in function "public: virtual bool __thiscall MySQLConnection::Open(void)" (?Open@MySQLConnection@@UAE_NXZ)
  43. 14>shared.lib(MySQLConnection.obj) : error LNK2019: unresolved external symbol _mysql_get_client_info@0 referenced in function "public: virtual bool __thiscall MySQLConnection::Open(void)" (?Open@MySQLConnection@@UAE_NXZ)
  44. 14>shared.lib(MySQLConnection.obj) : error LNK2019: unresolved external symbol _mysql_options@12 referenced in function "public: virtual bool __thiscall MySQLConnection::Open(void)" (?Open@MySQLConnection@@UAE_NXZ)
  45. 14>shared.lib(MySQLConnection.obj) : error LNK2019: unresolved external symbol _mysql_stmt_init@4 referenced in function "protected: void __thiscall MySQLConnection::PrepareStatement(unsigned int,char const *,enum ConnectionFlags)" (?PrepareStatement@MySQLConnection@@IAEXIPBDW4ConnectionFlags@@@Z)
  46. 14>shared.lib(MySQLConnection.obj) : error LNK2019: unresolved external symbol _mysql_stmt_prepare@12 referenced in function "protected: void __thiscall MySQLConnection::PrepareStatement(unsigned int,char const *,enum ConnectionFlags)" (?PrepareStatement@MySQLConnection@@IAEXIPBDW4ConnectionFlags@@@Z)
  47. 14>shared.lib(MySQLConnection.obj) : error LNK2019: unresolved external symbol _mysql_stmt_execute@4 referenced in function "public: bool __thiscall MySQLConnection::Execute(class PreparedStatement *)" (?Execute@MySQLConnection@@QAE_NPAVPreparedStatement@@@Z)
  48. 14>shared.lib(MySQLConnection.obj) : error LNK2019: unresolved external symbol _mysql_stmt_bind_param@8 referenced in function "public: bool __thiscall MySQLConnection::Execute(class PreparedStatement *)" (?Execute@MySQLConnection@@QAE_NPAVPreparedStatement@@@Z)
  49. 14>shared.lib(MySQLConnection.obj) : error LNK2019: unresolved external symbol _mysql_stmt_close@4 referenced in function "protected: void __thiscall MySQLConnection::PrepareStatement(unsigned int,char const *,enum ConnectionFlags)" (?PrepareStatement@MySQLConnection@@IAEXIPBDW4ConnectionFlags@@@Z)
  50. 14>shared.lib(PreparedStatement.obj) : error LNK2001: unresolved external symbol _mysql_stmt_close@4
  51. 14>shared.lib(MySQLConnection.obj) : error LNK2019: unresolved external symbol _mysql_stmt_result_metadata@4 referenced in function "public: bool __thiscall MySQLConnection::_Query(class PreparedStatement *,struct st_mysql_res * *,unsigned __int64 *,unsigned int *)" (?_Query@MySQLConnection@@QAE_NPAVPreparedStatement@@PAPAUst_mysql_res@@PA_KPAI@Z)
  52. 14>shared.lib(MySQLConnection.obj) : error LNK2019: unresolved external symbol _mysql_stmt_field_count@4 referenced in function "public: bool __thiscall MySQLConnection::_Query(class PreparedStatement *,struct st_mysql_res * *,unsigned __int64 *,unsigned int *)" (?_Query@MySQLConnection@@QAE_NPAVPreparedStatement@@PAPAUst_mysql_res@@PA_KPAI@Z)
  53. 14>shared.lib(MySQLConnection.obj) : error LNK2019: unresolved external symbol _mysql_autocommit@8 referenced in function "public: virtual bool __thiscall MySQLConnection::Open(void)" (?Open@MySQLConnection@@UAE_NXZ)
  54. 14>shared.lib(MySQLConnection.obj) : error LNK2019: unresolved external symbol _mysql_more_results@4 referenced in function "public: class PreparedResultSet * __thiscall MySQLConnection::Query(class PreparedStatement *)" (?Query@MySQLConnection@@QAEPAVPreparedResultSet@@PAVPreparedStatement@@@Z)
  55. 14>shared.lib(MySQLConnection.obj) : error LNK2019: unresolved external symbol _mysql_next_result@4 referenced in function "public: class PreparedResultSet * __thiscall MySQLConnection::Query(class PreparedStatement *)" (?Query@MySQLConnection@@QAEPAVPreparedResultSet@@PAVPreparedStatement@@@Z)
  56. 14>shared.lib(MySQLConnection.obj) : error LNK2019: unresolved external symbol _mysql_close@4 referenced in function "public: virtual __thiscall MySQLConnection::~MySQLConnection(void)" (??1MySQLConnection@@UAE@XZ)
  57. 14>shared.lib(PreparedStatement.obj) : error LNK2019: unresolved external symbol _mysql_stmt_param_count@4 referenced in function "public: __thiscall MySQLPreparedStatement::MySQLPreparedStatement(struct st_mysql_stmt *)" (??0MySQLPreparedStatement@@QAE@PAUst_mysql_stmt@@@Z)
  58. 14>shared.lib(PreparedStatement.obj) : error LNK2019: unresolved external symbol _mysql_stmt_attr_set@12 referenced in function "public: __thiscall MySQLPreparedStatement::MySQLPreparedStatement(struct st_mysql_stmt *)" (??0MySQLPreparedStatement@@QAE@PAUst_mysql_stmt@@@Z)
  59. 14>C:\Program Files\MySQL\MySQL Server 5.7\lib\libmysql.lib : warning LNK4272: library machine type 'x64' conflicts with target machine type 'X86'
  60. 14>C:\Projects\ALL WARCRAFT\5.4.8 (Build 18414)\SkyFire.548\Build\bin\Debug\worldserver.exe : fatal error LNK1120: 43 unresolved externals
  61. 14>Done building project "worldserver.vcxproj" -- FAILED.
  62. 15>------ Rebuild All started: Project: ALL_BUILD, Configuration: Debug Win32 ------
  63. 15>Building Custom Rule C:/Projects/ALL WARCRAFT/5.4.8 (Build 18414)/SkyFire.548/CMakeLists.txt
  64. 15>CMake does not need to re-run because C:/Projects/ALL WARCRAFT/5.4.8 (Build 18414)/SkyFire.548/Build/CMakeFiles/generate.stamp is up-to-date.
  65. 16>------ Skipped Rebuild All: Project: INSTALL, Configuration: Debug Win32 ------
  66. 16>Project not selected to build for this solution configuration
  67. ========== Rebuild All: 13 succeeded, 2 failed, 1 skipped ==========
  68.  
  69.  
  70.  
  71.  
  72.  
  73.  
  74.  
  75.  
  76.  
  77.  
  78.  
  79.  
  80.  
  81.  
  82.  
  83.  
  84.  
  85.  
  86.  
  87.  
  88.  
  89.  
  90.  
  91.  
  92.  
  93.  
  94.  
  95.  
  96.  
  97.  
  98.  
  99.  
  100.  
  101.  
  102.  
  103.  
  104.  
  105.  
  106.  
  107.  
  108.  
  109.  
  110.  
  111.  
  112.